4-Ethylphenylacetic acid

Kovats' RI, non-polar column, isothermal

View large format table.

Column type Active phase Temperature (C) I Reference Comment
PackedOV-101200.1452.Macek and Smolková-Keulemansová, 1985N2, Chromosorb W HP (100-120 mesh); Column length: 2. m

References

Macek and Smolková-Keulemansová, 1985
Macek, J.; Smolková-Keulemansová, E., Correlation of the chromatographic retention of some phenylacetic and phenylpropionic acid derivatives with molecular structure, J. Chromatogr., 1985, 333, 309-317, https://doi.org/10.1016/S0021-9673(01)87361-1 . [all data]