butane-2,3-diol acetate propanoate

Kovats' RI, polar column, temperature ramp

Data compiled by: NIST Mass Spectrometry Data Center, William E. Wallace, director

Column type Capillary
Active phase BP-20
Column length (m) 25.
Carrier gas
Substrate
Column diameter (mm) 0.32
Phase thickness (μm)
Tstart (C) 70.
Tend (C) 200.
Heat rate (K/min) 4.
Initial hold (min) 2.
Final hold (min)
I 1572.
ReferenceWyllie and Leach, 1990
Comment MSDC-RI

References

Wyllie and Leach, 1990
Wyllie, S.G.; Leach, D.N., Aroma volatiles of Cucumis melo cv. golden crispy, J. Agric. Food Chem., 1990, 38, 11, 2042-2044, https://doi.org/10.1021/jf00101a008 . [all data]