Cinnamyl (E)-p-coumarate, mono-TMS

Van Den Dool and Kratz RI, non-polar column, temperature ramp

Data compiled by: NIST Mass Spectrometry Data Center, William E. Wallace, director

Column type Capillary
Active phase Methyl Silicone
Column length (m) 25.
Carrier gas He
Substrate
Column diameter (mm) 0.32
Phase thickness (μm) 0.5
Tstart (C) 75.
Tend (C) 300.
Heat rate (K/min) 3.
Initial hold (min)
Final hold (min)
I 2794.
ReferenceGreenaway and Whatley, 1990
Comment MSDC-RI

References

Greenaway and Whatley, 1990
Greenaway, W.; Whatley, F.R., Resolution of complex mixtures of phenolics in poplar bud exudate by analysis of gas chromatography-mass spectrometry data, J. Chromatogr., 1990, 519, 1, 145-158, https://doi.org/10.1016/0021-9673(90)85143-J . [all data]