Metoprolol, HFB

Kovats' RI, non-polar column, isothermal

Data compiled by: NIST Mass Spectrometry Data Center, William E. Wallace, director

Column type Packed
Active phase OV-1
Column length (m) 1.
Carrier gas N2
Substrate Chromosorb W AW DMCS
Column diameter (mm)
Phase thickness (μm)
Temperature (C) 210.
I 2024.
ReferenceMarko, 1988
Comment MSDC-RI

References

Marko, 1988
Marko, V., Retention indices of some β-adrenolytics and their perfluoroacyl derivatives, Chem. Pap., 1988, 42, 3, 375-380. [all data]