Midazolam M (hydroxy-), acetylated

Kovats' RI, non-polar column, temperature ramp

Data compiled by: NIST Mass Spectrometry Data Center, William E. Wallace, director

Column type Capillary
Active phase Cross-Linked Methylsilicone
Column length (m) 12.
Carrier gas He
Substrate
Column diameter (mm) 0.2
Phase thickness (μm) 0.33
Tstart (C) 100.
Tend (C) 310.
Heat rate (K/min) 30.
Initial hold (min) 3.
Final hold (min) 5.
I 2820.
ReferenceMaurer and Pfleger, 1987
Comment MSDC-RI

References

Maurer and Pfleger, 1987
Maurer, H.; Pfleger, K., Identification and differentiation of benzodiazepines and their metabolites in urine by computerized gas chromatography-mass spectrometry, J. Chromatogr., 1987, 422, 85-101, https://doi.org/10.1016/0378-4347(87)80442-5 . [all data]