ent-16α(H)-Kaurane

Kovats' RI, non-polar column, isothermal

View large format table.

Column type Active phase Temperature (C) I Reference Comment
CapillaryCross-Linked Methylsilicone150.1967.Noble, Alexander, et al., 1986Column length: 50. m; Column diameter: 0.2 mm

References

Noble, Alexander, et al., 1986
Noble, R.A.; Alexander, R.; Kagi, R.I.; Knox, J., Identification of some diterpenoid hydrocarbons in petroleum, Org. Geochem., 1986, 10, 4-6, 825-829, https://doi.org/10.1016/S0146-6380(86)80019-5 . [all data]