5-(5-Methyl-2-furyl)-6-methyl-2,3-dihydro-1H-pyrrolizine

Normal alkane RI, polar column, temperature ramp

View large format table.

Column type Active phase I Reference Comment
CapillaryCarbowax 20M2389.Tressl, Rewicki, et al., 19852. K/min; Column length: 25. m; Column diameter: 0.32 mm; Tstart: 70. C; Tend: 180. C

References

Tressl, Rewicki, et al., 1985
Tressl, R.; Rewicki, D.; Helak, B.; Kamperschröer, H.; Martin, N., Formation of 2,3-dihydro-1H-pyrrolizines as proline specific Maillard products, J. Agric. Food Chem., 1985, 33, 5, 919-923, https://doi.org/10.1021/jf00065a036 . [all data]