Silane, chloromethyl, triisopropyloxy

Normal alkane RI, non-polar column, temperature ramp

View large format table.

Column type Active phase I Reference Comment
PackedSE-301160.Zenkevich, Shchegolev, et al., 1984Helium, Chromosorb W (80-100 mesh), 50. C @ 0. min, 5. K/min, 220. C @ 0. min; Column length: 3. m

References

Zenkevich, Shchegolev, et al., 1984
Zenkevich, I.G.; Shchegolev, A.E.; Finogenov, Yu.; Ivin B.A., Mass Spectrometric Characterization of Alkyl- and Alkoxy(chlormethyl)silanes, VINITI, # 6805-84, 1984, 29. [all data]