1,3-Disiloxane, 1,3-diethoxy, 1,3-dimethyl, 1,3-bis-(chloromethyl)

Normal alkane RI, non-polar column, temperature ramp

Data compiled by: NIST Mass Spectrometry Data Center, William E. Wallace, director

Column type Packed
Active phase SE-30
Column length (m) 1.8
Carrier gas Helium
Substrate Chromosorb W (80-100 mesh)
Column diameter (mm)
Phase thickness (μm)
Tstart (C) 100.
Tend (C) 250.
Heat rate (K/min) 5.
Initial hold (min) 0.
Final hold (min) 0.
I 1390.
ReferenceZenkevich, Finogenov, et al., 1984
Comment MSDC-RI

References

Zenkevich, Finogenov, et al., 1984
Zenkevich, I.G.; Finogenov, Yu.S.; Shchegolev, A.E.; Tumanova, S.V.; Ivin, B.A., Mass Spectrometric characterization of 1,3-Dialkoxy-1,3-disiloxanes, VINITI, # 6806-84, 1984, 22. [all data]