Promethazine M (HO-), monoacetylated

Kovats' RI, non-polar column, temperature ramp

View large format table.

Column type Active phase I Reference Comment
PackedOV-1012690.Maurer and Pfleger, 1988N2, Chromosorb G HP, 100. C @ 3. min, 30. K/min, 310. C @ 5. min; Column length: 0.6 m

Normal alkane RI, non-polar column, temperature ramp

View large format table.

Column type Active phase I Reference Comment
PackedOV-1012690.Maurer and Pfleger, 1984N2, Chromosorb G HP, 20. K/min, 310. C @ 3. min; Column length: 0.6 m; Tstart: 100. C

References

Maurer and Pfleger, 1988
Maurer, H.; Pfleger, K., Identification of phenothiazine antihistamines and their metabolites in urine, Arch. Toxicol., 1988, 62, 2-3, 185-191, https://doi.org/10.1007/BF00570138 . [all data]

Maurer and Pfleger, 1984
Maurer, H.; Pfleger, K., Screening procedure for detection of phenothiazine and analogous neuroleptics and their metabolites in urine using a computerized gas chromatographic-mass spectrometric technique, J. Chromatogr., 1984, 306, 125-145, https://doi.org/10.1016/S0378-4347(00)80876-2 . [all data]