Alimemazine M (nor-), acetylated

Normal alkane RI, non-polar column, temperature ramp

Data compiled by: NIST Mass Spectrometry Data Center, William E. Wallace, director

Column type Packed
Active phase OV-101
Column length (m) 0.6
Carrier gas N2
Substrate Chromosorb G HP
Column diameter (mm)
Phase thickness (μm)
Tstart (C) 100.
Tend (C) 310.
Heat rate (K/min) 20.
Initial hold (min)
Final hold (min) 3.
I 2709.
ReferenceMaurer and Pfleger, 1984
Comment MSDC-RI

References

Maurer and Pfleger, 1984
Maurer, H.; Pfleger, K., Screening procedure for detection of phenothiazine and analogous neuroleptics and their metabolites in urine using a computerized gas chromatographic-mass spectrometric technique, J. Chromatogr., 1984, 306, 125-145, https://doi.org/10.1016/S0378-4347(00)80876-2 . [all data]