5-Chlorohexadecanoic acid, methyl ester

Kovats' RI, non-polar column, isothermal

Data compiled by: NIST Mass Spectrometry Data Center, William E. Wallace, director

Column type CapillaryCapillary
Active phase SE-30SE-30
Column length (m) 25.25.
Carrier gas N2N2
Substrate
Column diameter (mm) 0.220.22
Phase thickness (μm)
Temperature (C) 180.200.
I 2089.2090.
ReferenceHaken and Korhonen, 1984Haken and Korhonen, 1984
Comment MSDC-RI MSDC-RI

References

Haken and Korhonen, 1984
Haken, J.K.; Korhonen, I.O.O., Gas chromatography of homologous esters. XXV. Capillary column studies of monochlorinated C5-C18 n-carboxylic esters, J. Chromatogr., 1984, 298, 89-100, https://doi.org/10.1016/S0021-9673(01)92697-4 . [all data]