5-Chlorododecanoic acid, methyl ester

Kovats' RI, non-polar column, isothermal

Data compiled by: NIST Mass Spectrometry Data Center, William E. Wallace, director

Column type Capillary
Active phase SE-30
Column length (m) 25.
Carrier gas N2
Substrate
Column diameter (mm) 0.22
Phase thickness (μm)
Temperature (C) 140.
I 1683.
ReferenceHaken and Korhonen, 1984
Comment MSDC-RI

References

Haken and Korhonen, 1984
Haken, J.K.; Korhonen, I.O.O., Gas chromatography of homologous esters. XXV. Capillary column studies of monochlorinated C5-C18 n-carboxylic esters, J. Chromatogr., 1984, 298, 89-100, https://doi.org/10.1016/S0021-9673(01)92697-4 . [all data]