Selina-4,7-diene

Kovats' RI, polar column, temperature ramp

Data compiled by: NIST Mass Spectrometry Data Center, William E. Wallace, director

Column type Capillary
Active phase Carbowax 20M
Column length (m) 50.
Carrier gas He
Substrate
Column diameter (mm) 0.3
Phase thickness (μm)
Tstart (C) 70.
Tend (C) 210.
Heat rate (K/min) 2.
Initial hold (min)
Final hold (min)
I 1777.
ReferenceRandriamiharisoa and Gaydou, 1987
Comment MSDC-RI

References

Randriamiharisoa and Gaydou, 1987
Randriamiharisoa, R.P.; Gaydou, E.M., Composition of Palmarosa (Cymbopogon martinii) essential oil from Madagascar, J. Agric. Food Chem., 1987, 35, 1, 62-66, https://doi.org/10.1021/jf00073a015 . [all data]