2,2-dichloroethyl undecanoate

Kovats' RI, non-polar column, isothermal

View large format table.

Column type Active phase Temperature (C) I Reference Comment
CapillarySE-30140.1778.Korhonen, 1985N2; Column length: 25. m; Column diameter: 0.33 mm
CapillarySE-30160.1781.Korhonen, 1985N2; Column length: 25. m; Column diameter: 0.33 mm
CapillarySE-30180.1785.Korhonen, 1985N2; Column length: 25. m; Column diameter: 0.33 mm
CapillarySE-30200.1791.Korhonen, 1985N2; Column length: 25. m; Column diameter: 0.33 mm
CapillarySE-30220.1799.Korhonen, 1985N2; Column length: 25. m; Column diameter: 0.33 mm

Kovats' RI, polar column, isothermal

View large format table.

Column type Active phase Temperature (C) I Reference Comment
CapillaryOV-351120.2245.Korhonen, 1985N2; Column length: 25. m; Column diameter: 0.32 mm
CapillaryOV-351140.2256.Korhonen, 1985N2; Column length: 25. m; Column diameter: 0.32 mm
CapillaryOV-351160.2255.Korhonen, 1985N2; Column length: 25. m; Column diameter: 0.32 mm
CapillaryOV-351180.2274.Korhonen, 1985N2; Column length: 25. m; Column diameter: 0.32 mm
CapillaryOV-351200.2275.Korhonen, 1985N2; Column length: 25. m; Column diameter: 0.32 mm
CapillaryOV-351220.2294.Korhonen, 1985N2; Column length: 25. m; Column diameter: 0.32 mm

Van Den Dool and Kratz RI, non-polar column, temperature ramp

View large format table.

Column type Active phase I Reference Comment
CapillarySE-301790.Korhonen, 1985N2, 6. K/min; Column length: 25. m; Column diameter: 0.33 mm; Tstart: 100. C; Tend: 320. C

Van Den Dool and Kratz RI, polar column, temperature ramp

View large format table.

Column type Active phase I Reference Comment
CapillaryOV-3512260.Korhonen, 1985N2, 6. K/min; Column length: 25. m; Column diameter: 0.32 mm; Tstart: 100. C; Tend: 230. C

References

Korhonen, 1985
Korhonen, I.O.O., Gas-liquid chromatographic analyses. XLIII. Retention increments for 2-chloro-, 2,2-dichloro- and 2,2,2-trichloroethyl esters of aliphatic C2-C20 n-alkanoic acids on SE-30 and OV-351 capillary columns, J. Chromatogr., 1985, 329, 43-56, https://doi.org/10.1016/S0021-9673(01)81894-X . [all data]