Tyramine, PFB-TMS

Van Den Dool and Kratz RI, non-polar column, temperature ramp

View large format table.

Column type Active phase I Reference Comment
PackedSE-302001.Lhuguenot and Maume, 1974Mixture, GasChrom P, 1. K/min; Column length: 3. m; Tstart: 170. C

References

Lhuguenot and Maume, 1974
Lhuguenot, J.-C.; Maume, B.F., Improvements in quantitative gas phase analysis of catecholamines in the picomole range by electron-capture detection and mass fragmentography of their pentafluorobenzylimine-timethylsilyl derivatives, J. Chromatogr. Sci., 1974, 12, 7, 411-417, https://doi.org/10.1093/chromsci/12.7.411 . [all data]