2,2,2-Trichloroethyl tetradecanoate

Kovats' RI, polar column, isothermal

Data compiled by: NIST Mass Spectrometry Data Center, William E. Wallace, director

Column type CapillaryCapillaryCapillaryCapillaryCapillary
Active phase OV-351OV-351OV-351OV-351OV-351
Column length (m) 25.25.25.25.25.
Carrier gas N2N2N2N2N2
Substrate
Column diameter (mm) 0.320.320.320.320.32
Phase thickness (μm)
Temperature (C) 140.160.180.200.220.
I 2537.2544.2565.2568.2582.
ReferenceKorhonen, 1985Korhonen, 1985Korhonen, 1985Korhonen, 1985Korhonen, 1985
Comment MSDC-RI MSDC-RI MSDC-RI MSDC-RI MSDC-RI

References

Korhonen, 1985
Korhonen, I.O.O., Gas-liquid chromatographic analyses. XLIII. Retention increments for 2-chloro-, 2,2-dichloro- and 2,2,2-trichloroethyl esters of aliphatic C2-C20 n-alkanoic acids on SE-30 and OV-351 capillary columns, J. Chromatogr., 1985, 329, 43-56, https://doi.org/10.1016/S0021-9673(01)81894-X . [all data]