Adamantane-1-carboxylic acid, propyl ester

Kovats' RI, non-polar column, isothermal

Data compiled by: NIST Mass Spectrometry Data Center, William E. Wallace, director

Column type CapillaryCapillaryCapillaryCapillary
Active phase SE-30SE-30SE-30SE-30
Column length (m) 50.50.50.50.
Carrier gas N2N2N2N2
Substrate
Column diameter (mm) 0.270.270.270.27
Phase thickness (μm)
Temperature (C) 145.160.175.190.
I 1603.1617.1629.1642.
ReferenceBurkhard, Vais, et al., 1969Burkhard, Vais, et al., 1969Burkhard, Vais, et al., 1969Burkhard, Vais, et al., 1969
Comment MSDC-RI MSDC-RI MSDC-RI MSDC-RI

References

Burkhard, Vais, et al., 1969
Burkhard, J.; Vais, J.; Vodicka, L.; Landa, S., Adamantane and its derivatives. XVI. The gas chromatographic characterization of adamantane derivatives, J. Chromatogr., 1969, 42, 207-218, https://doi.org/10.1016/S0021-9673(01)80617-8 . [all data]