5-octyldihydro-2(3H)-thiophenone

Normal alkane RI, non-polar column, temperature ramp

Data compiled by: NIST Mass Spectrometry Data Center, William E. Wallace, director

Column type Capillary
Active phase PS-255
Column length (m) 30.
Carrier gas H2
Substrate
Column diameter (mm) 0.32
Phase thickness (μm) 1.
Tstart (C) 40.
Tend (C) 300.
Heat rate (K/min) 4.
Initial hold (min) 10.
Final hold (min) 5.
I 1754.
ReferenceRoling, Schmarr, et al., 1998
Comment MSDC-RI

References

Roling, Schmarr, et al., 1998
Roling, I.; Schmarr, H.-G.; Eisenreich, W.; Engel, K.-H., Analytical and sensory characterization of γ- and δ-thiolactones, J. Agric. Food Chem., 1998, 46, 2, 668-672, https://doi.org/10.1021/jf970748+ . [all data]