Tritriacontane, 7,11-dimethyl

Normal alkane RI, non-polar column, temperature ramp

Data compiled by: NIST Mass Spectrometry Data Center, William E. Wallace, director

Column type Packed
Active phase OV-101
Column length (m) 3.
Carrier gas Helium
Substrate Gas-Chrom Q (100-120 mesh)
Column diameter (mm)
Phase thickness (μm)
Tstart (C) 150.
Tend (C) 320.
Heat rate (K/min) 3.
Initial hold (min)
Final hold (min) 25.
I 3370.
ReferenceNelson, de Renobales, et al., 1989
Comment MSDC-RI

References

Nelson, de Renobales, et al., 1989
Nelson, D.R.; de Renobales, M.; Dwyer, L.A.; Zamboni, A.C.; Fatland, C.L.; Blomquist, G.J., Novel very long-chain methyl branched alcohols and their esters, and methyl branched alkanes in pupae of the gabbage looper, Trichoplusa ni (Hubner), Insect Biochem., 1989, 19, 2, 197-208, https://doi.org/10.1016/0020-1790(89)90092-9 . [all data]