ent-6α,7α-Dihydroxy-kaurenoic acid, Me-TMS

Normal alkane RI, non-polar column, custom temperature program

Data compiled by: NIST Mass Spectrometry Data Center, William E. Wallace, director

Column type Capillary
Active phase 5 % Phenyl methyl siloxane
Column length (m)
Carrier gas
Substrate
Column diameter (mm)
Phase thickness (μm)
Program not specified
I 2593.
ReferenceDavidson, Elliott, et al., 2003
Comment MSDC-RI

References

Davidson, Elliott, et al., 2003
Davidson, S.E.; Elliott, R.C.; Helliwell, C.A.; Poole, A.T.; Reid, J.B., The PEa gene NA encodes ent-Kaurenoic acid oxidase, Plant Physiol., 2003, 131, 1, 335-344, https://doi.org/10.1104/pp.012963 . [all data]