ent-6α,7α,16α,17-tetra-(OH)-16,17-dihydrokaurenonic acid, Me-TMS

Van Den Dool and Kratz RI, non-polar column, custom temperature program

View large format table.

Column type Active phase I Reference Comment
CapillaryOV-12970.Santes, Hedden, et al., 199525. m/0.2 mm/0.25 μm; Program: 60C(2min) => 10C/min => 150C => 3C/min => 300C
CapillaryOV-12977.Santes, Hedden, et al., 199525. m/0.2 mm/0.25 μm; Program: 60C(2min) => 10C/min => 150C => 3C/min => 300C

Normal alkane RI, non-polar column, custom temperature program

View large format table.

Column type Active phase I Reference Comment
CapillaryOV-12953.Yamane, Fujioka, et al., 198825. m/0.20 mm/0.25 μm; Program: not specified

References

Santes, Hedden, et al., 1995
Santes, C.M.; Hedden, P.; Gaskin, P.; Garcia-Martinez, J.L., Gibberellins and related compounds in young fruits of pea and their relationship to fruit-set, Phytochemistry, 1995, 40, 5, 1347-1355, https://doi.org/10.1016/0031-9422(95)00489-T . [all data]

Yamane, Fujioka, et al., 1988
Yamane, H.; Fujioka, S.; Spray, C.R.; Phinney, B.O.; MacMillan, J.; Gaskin, P.; Takahashi, N., Endogenous Gibberellines from Sporophytes of Two Tree Ferns, Cibotium glaucum and Dicksonia antarctica, Plant Phisiol., 1988, 86, 3, 857-862, https://doi.org/10.1104/pp.86.3.857 . [all data]