ent-16β,17-(OH)2 KA, MeTMS

Van Den Dool and Kratz RI, non-polar column, custom temperature program

Data compiled by: NIST Mass Spectrometry Data Center, William E. Wallace, director

Column type CapillaryCapillary
Active phase OV-1OV-1
Column length (m) 25.25.
Carrier gas
Substrate
Column diameter (mm) 0.20.2
Phase thickness (μm) 0.250.25
Program 60C(2min) => 10C/min => 150C => 3C/min => 300C60C(2min) => 10C/min => 150C => 3C/min => 300C
I 2792.2796.
ReferenceSantes, Hedden, et al., 1995Santes, Hedden, et al., 1995
Comment MSDC-RI MSDC-RI

References

Santes, Hedden, et al., 1995
Santes, C.M.; Hedden, P.; Gaskin, P.; Garcia-Martinez, J.L., Gibberellins and related compounds in young fruits of pea and their relationship to fruit-set, Phytochemistry, 1995, 40, 5, 1347-1355, https://doi.org/10.1016/0031-9422(95)00489-T . [all data]