2,3,4,9-tetrachlorodibenzofuran

Van Den Dool and Kratz RI, non-polar column, custom temperature program

Data compiled by: NIST Mass Spectrometry Data Center, William E. Wallace, director

Column type Capillary
Active phase HP-5
Column length (m) 25.
Carrier gas He
Substrate
Column diameter (mm) 0.20
Phase thickness (μm) 0.11
Program 100 0C (1 min) 20 0C/min -> 180 0C 5 0C/min -> 290 0C (until elution of the last peak)
I 2318.
ReferenceKorhonen and Mantykoski, 1989
Comment MSDC-RI

References

Korhonen and Mantykoski, 1989
Korhonen, I.O.O.; Mantykoski, K.M., Gas-Liquid Chromatographic Analyses. L. Retention, Dispersion and Selectivity Indices of Polychlorinated Dibenzo-p-dioxins and Dibenzofurans, J. Chromatogr., 1989, 477, 2, 327-336, https://doi.org/10.1016/S0021-9673(01)89641-2 . [all data]