GA29-2β-O-glucoside, permethylated

Kovats' RI, non-polar column, temperature ramp

View large format table.

Column type Active phase I Reference Comment
CapillaryMethyl Silicone3569.Schmidt, Schneider, et al., 198825. m/0.31 mm/0.17 μm, He, 60. C @ 1. min, 25. K/min; Tend: 260. C

References

Schmidt, Schneider, et al., 1988
Schmidt, J.; Schneider, G.; Jensen, E., Capillary gas chromatography/mass spectrometry of permethylated gibberellin glucosides, Biomed. Environ. Mass Spectrom., 1988, 17, 1, 7-13, https://doi.org/10.1002/bms.1200170105 . [all data]