2,2,6,7-tetramethylbicyclo-[4.3.0]nona-4,9(1)-dien-8-ol

Van Den Dool and Kratz RI, polar column, temperature ramp

View large format table.

Column type Active phase I Reference Comment
CapillaryDB-Wax2033.Winterhalter, Lander, et al., 198730. m/0.25 mm/0.25 μm, He, 4. K/min; Tstart: 50. C; Tend: 250. C

References

Winterhalter, Lander, et al., 1987
Winterhalter, P.; Lander, V.; Schreier, P., Influence of sample preparation on the composition of quince (Cydonia oblonga, Mill.) flavor, J. Agric. Food Chem., 1987, 35, 3, 335-337, https://doi.org/10.1021/jf00075a013 . [all data]