2-(1-pyrrolyl)-1-ethanol

Van Den Dool and Kratz RI, polar column, custom temperature program

View large format table.

Column type Active phase I Reference Comment
CapillaryCarbowax 20M1935.Baltes and Bochmann, 1987Column length: 50. m; Column diameter: 0.3 mm; Program: not specified
CapillaryCarbowax 20M1934.Baltes and Bochmann, 1987Column length: 50. m; Column diameter: 0.3 mm; Program: not specified

References

Baltes and Bochmann, 1987
Baltes, W.; Bochmann, G., Model reactions on roast aroma formation. 1. Reaction of serine and threonine with sucrose under the conditions of coffee roasting and identification of new coffee aroma compounds, J. Agric. Food Chem., 1987, 35, 3, 340-346, https://doi.org/10.1021/jf00075a015 . [all data]