2,8-dichlorodecane

Kovats' RI, polar column, isothermal

View large format table.

Column type Active phase Temperature (C) I Reference Comment
PackedPEG-20M130.1752.Jaworski and Zolna, 1982Chromosorb W; Column length: 2.8 m

Kovats' RI, polar column, temperature ramp

View large format table.

Column type Active phase I Reference Comment
PackedPEG-20M1748.Jaworski and Zolna, 1982Chromosorb W, 6. K/min; Column length: 2.8 m; Tstart: 110. C; Tend: 200. C

References

Jaworski and Zolna, 1982
Jaworski, M.; Zolna, H., Oznaczanie alkanów, monochloroalkanów i polichloroalkanów metoda chromatografii gazowej, Chem. Anal. (Warsaw), 1982, 27, 97-105. [all data]