5B-Androstan-3B,16B,17B-triol, tris-TMS

Van Den Dool and Kratz RI, non-polar column, temperature ramp

Data compiled by: NIST Mass Spectrometry Data Center, William E. Wallace, director

Column type Packed
Active phase SE-30
Column length (m) 1.5
Carrier gas
Substrate Chromosorb W AW DMCS
Column diameter (mm)
Phase thickness (μm)
Tstart (C) 200.
Tend (C)
Heat rate (K/min) 1.
Initial hold (min)
Final hold (min)
I 2792.
ReferenceGrote and Spiteller, 1977
Comment MSDC-RI

References

Grote and Spiteller, 1977
Grote, H.; Spiteller, G., Location of Functional Groups with the Aid of Mass Spectrometry. XVI-Mass Spectra of Trimethylsilylated Androstan-3,16,17β-triols, Biomed. Mass Spectrom., 1977, 4, 4, 216-219, https://doi.org/10.1002/bms.1200040405 . [all data]