5-methoxy-N-dimethyltryptamine, TMS

Normal alkane RI, non-polar column, temperature ramp

View large format table.

Column type Active phase I Reference Comment
PackedSE-302060.Narasimhachari, Spaide, et al., 1971Column length: 2. m; Tstart: 140. C

References

Narasimhachari, Spaide, et al., 1971
Narasimhachari, N.; Spaide, J.; Heller, B., Gas liquid chromatographic and mass spectrometric studies on trimethylsilyl derivatives of N-methyl- and N,N-dimethyltryptamines, J. Chromatogr. Sci., 1971, 9, 8, 502-505, https://doi.org/10.1093/chromsci/9.8.502 . [all data]