R,S-4'-Methoxy-α-pyrrolidinopropiophenone-M (desamino-oxo-)

Kovats' RI, non-polar column, temperature ramp

View large format table.

Column type Active phase I Reference Comment
CapillaryHP-11440.Springer, Fritschi, et al., 2003He, 100. C @ 3. min, 30. K/min, 310. C @ 8. min; Column length: 12. m; Column diameter: 0.2 mm

References

Springer, Fritschi, et al., 2003
Springer, D.; Fritschi, G.; Maurer, H.H., Metabolism and toxicological detection of the new designer drug 4'-methoxy-α-pyrrolidinopropiophenone studied in rat urine using gas chromatography-mass spectrometry, J. Chromatogr. B, 2003, 793, 2, 331-342, https://doi.org/10.1016/S1570-0232(03)00334-9 . [all data]