Octanoic acid, 7-methyl, methyl ester

Kovats' RI, polar column, isothermal

Data compiled by: NIST Mass Spectrometry Data Center, William E. Wallace, director

Column type Capillary
Active phase Carbowax
Column length (m)
Carrier gas Ar
Substrate
Column diameter (mm)
Phase thickness (μm)
Temperature (C) 100.
I 1470.
ReferenceSchomburg, 1967
Comment MSDC-RI

References

Schomburg, 1967
Schomburg, G., Struktur und Retentionsverhalten von Offenkettigen und Cyclischen Kohlenwasserstoffen und Deren Einfacher Substitutionsprodukte, Anal. Chim. Acta., 1967, 38, 45-64, https://doi.org/10.1016/S0003-2670(01)80560-2 . [all data]