Butanoic acid, 4-chloro, 1,1-dimethylpropyl ester

Kovats' RI, non-polar column, isothermal

Data compiled by: NIST Mass Spectrometry Data Center, William E. Wallace, director

Column type CapillaryCapillaryCapillaryCapillaryCapillary
Active phase SE-30SE-30SE-30SE-30SE-30
Column length (m) 25.25.25.25.25.
Carrier gas N2N2N2N2N2
Substrate
Column diameter (mm) 0.330.330.330.330.33
Phase thickness (μm)
Temperature (C) 100.120.140.60.80.
I 1184.1180.1207.1191.1188.
ReferenceHaken, Madden, et al., 1985Haken, Madden, et al., 1985Haken, Madden, et al., 1985Haken, Madden, et al., 1985Haken, Madden, et al., 1985
Comment MSDC-RI MSDC-RI MSDC-RI MSDC-RI MSDC-RI

Kovats' RI, polar column, isothermal

Data compiled by: NIST Mass Spectrometry Data Center, William E. Wallace, director

Column type CapillaryCapillaryCapillaryCapillary
Active phase OV-351OV-351OV-351OV-351
Column length (m) 25.25.25.25.
Carrier gas N2N2N2N2
Substrate
Column diameter (mm) 0.320.320.320.32
Phase thickness (μm)
Temperature (C) 100.120.60.80.
I 1565.1583.1552.1556.
ReferenceHaken, Madden, et al., 1985Haken, Madden, et al., 1985Haken, Madden, et al., 1985Haken, Madden, et al., 1985
Comment MSDC-RI MSDC-RI MSDC-RI MSDC-RI

References

Haken, Madden, et al., 1985
Haken, J.K.; Madden, B.G.; Korhonen, I.O.O., Gas chromatography of homologous esters. XXXI. Butanoyl and monochlorobutanoyl esters of lower saturated branched chain and unsaturated alcohols on SE-30 and OV-351 capillary columns, J. Chromatogr., 1985, 325, 61-73, https://doi.org/10.1016/S0021-9673(00)96008-4 . [all data]