6-Chloro-N,N'-(1,1,3,3-tetramethylbutyl)-[1,3,5]triazine-2,4-diamine

Kovats' RI, non-polar column, isothermal

View large format table.

Column type Active phase Temperature (C) I Reference Comment
CapillaryDB-1190.2344.28Mijin, Antonovic, et al., 200330. m/0.256 mm/0.25 μm
CapillaryDB-5190.2390.01Mijin, Antonovic, et al., 200360. m/0.321 mm/0.25 μm
CapillaryDB-1190.2344.28Antonovic and Boncic-Caricic, 199430. m/0.256 mm/0.25 μm, N2
CapillaryDB-1210.2363.13Antonovic and Boncic-Caricic, 199430. m/0.256 mm/0.25 μm, N2
CapillaryDB-1230.2373.88Antonovic and Boncic-Caricic, 199430. m/0.256 mm/0.25 μm, N2
CapillaryDB-5190.2390.01Antonovic and Boncic-Caricic, 199460. m/0.321 mm/0.25 μm, N2
CapillaryDB-5210.2408.88Antonovic and Boncic-Caricic, 199460. m/0.321 mm/0.25 μm, N2

References

Mijin, Antonovic, et al., 2003
Mijin, D.Z.; Antonovic, D.; Jovanovic, B.Z., Gas chromatographic retention indices for N-substituted amino s-triazines on capillary columns. Part V. Temperature dependence of the retention index, J. Serb. Chem. Soc., 2003, 68, 11, 825-831, https://doi.org/10.2298/JSC0311825M . [all data]

Antonovic and Boncic-Caricic, 1994
Antonovic, D.G.; Boncic-Caricic, G.A., Gas chromatographic retention indices for N-substituted amino s-triazines on DB-1 and DB-5 capillary columns, J. Serb. Chem. Soc., 1994, 59, 12, 993-996. [all data]