2-1,1,3-trimethylbutylamino-4,6-dichloro-s-triazine

Kovats' RI, non-polar column, isothermal

View large format table.

Column type Active phase Temperature (C) I Reference Comment
CapillaryDB-1190.1814.45Mijin, Antonovic, et al., 200330. m/0.256 mm/0.25 μm
CapillaryDB-5190.1843.66Mijin, Antonovic, et al., 200360. m/0.321 mm/0.25 μm
CapillaryDB-1190.1814.45Antonovic and Boncic-Caricic, 199430. m/0.256 mm/0.25 μm, N2
CapillaryDB-1210.1822.63Antonovic and Boncic-Caricic, 199430. m/0.256 mm/0.25 μm, N2
CapillaryDB-1230.1832.88Antonovic and Boncic-Caricic, 199430. m/0.256 mm/0.25 μm, N2
CapillaryDB-5190.1843.66Antonovic and Boncic-Caricic, 199460. m/0.321 mm/0.25 μm, N2
CapillaryDB-5210.1851.85Antonovic and Boncic-Caricic, 199460. m/0.321 mm/0.25 μm, N2

References

Mijin, Antonovic, et al., 2003
Mijin, D.Z.; Antonovic, D.; Jovanovic, B.Z., Gas chromatographic retention indices for N-substituted amino s-triazines on capillary columns. Part V. Temperature dependence of the retention index, J. Serb. Chem. Soc., 2003, 68, 11, 825-831, https://doi.org/10.2298/JSC0311825M . [all data]

Antonovic and Boncic-Caricic, 1994
Antonovic, D.G.; Boncic-Caricic, G.A., Gas chromatographic retention indices for N-substituted amino s-triazines on DB-1 and DB-5 capillary columns, J. Serb. Chem. Soc., 1994, 59, 12, 993-996. [all data]