6-Chloro-N,N'-(cyclohexyl)-[1,3,5]triazine-2,4-diamine

Kovats' RI, non-polar column, isothermal

View large format table.

Column type Active phase Temperature (C) I Reference Comment
CapillaryDB-1190.2345.05Mijin, Antonovic, et al., 200330. m/0.256 mm/0.25 μm
CapillaryDB-5190.2391.99Mijin, Antonovic, et al., 200360. m/0.321 mm/0.25 μm

References

Mijin, Antonovic, et al., 2003
Mijin, D.Z.; Antonovic, D.; Jovanovic, B.Z., Gas chromatographic retention indices for N-substituted amino s-triazines on capillary columns. Part V. Temperature dependence of the retention index, J. Serb. Chem. Soc., 2003, 68, 11, 825-831, https://doi.org/10.2298/JSC0311825M . [all data]