Abieta-8(14),13(15)-diene

Normal alkane RI, non-polar column, temperature ramp

Data compiled by: NIST Mass Spectrometry Data Center, William E. Wallace, director

Column type Capillary
Active phase DB-1
Column length (m) 50.
Carrier gas
Substrate
Column diameter (mm) 0.25
Phase thickness (μm) 0.25
Tstart (C) 60.
Tend (C) 240.
Heat rate (K/min) 3.
Initial hold (min)
Final hold (min)
I 2121.
ReferenceVelasco-Negueruela, Pérez-Alonso, et al., 2005
Comment MSDC-RI

Kovats' RI, non-polar column, temperature ramp

Data compiled by: NIST Mass Spectrometry Data Center, William E. Wallace, director

Column type CapillaryCapillaryCapillary
Active phase DB-5SE-54SE-54
Column length (m) 30.30.30.
Carrier gas HeHe
Substrate
Column diameter (mm) 0.260.260.26
Phase thickness (μm) 0.250.250.25
Tstart (C) 60.60.60.
Tend (C) 246.246.246.
Heat rate (K/min) 3.3.3.
Initial hold (min)
Final hold (min)
I 2154.2147.2147.
ReferenceAdams, Morris, et al., 2005Adams, 2000Adams, 2000, 2
Comment MSDC-RI MSDC-RI MSDC-RI

References

Velasco-Negueruela, Pérez-Alonso, et al., 2005
Velasco-Negueruela, A.; Pérez-Alonso, M.J.; Palá-Paúl, J.; Iñigo, A.; López, G., The volatile oil composition of the berries of Juniperus macrocarpa Sibth. and Sm., gathered in Spain, J. Essent. Oil Res., 2005, 17, 1, 61-63, https://doi.org/10.1080/10412905.2005.9698831 . [all data]