Cortisol tetra-TMS

Normal alkane RI, non-polar column, custom temperature program

View large format table.

Column type Active phase I Reference Comment
CapillaryHP-13314.Pereira, Marques, et al., 200117. m/0.20 mm/0.11 μm, Helium; Program: 180 0C 3 0C/min -> 229 0C 40 0C/min -> 310 0C (5 min)

References

Pereira, Marques, et al., 2001
Pereira, H.M.G.; Marques, M.A.S.; Cardoso, J.N.; Neto, F.R.A., Derivatization study of endogenous and synthetic corticosteroids by gas chromatography mass spectrometry in Recent Advances in Doping Analysis, Schanzer, W.; Geyer, H.; Gotzmann, A.; Mareck-Engelke, U., ed(s)., Sport und Buch Strauss, Koln, 2001, 203-207. [all data]