Jasmonic acid, TBDMS

Van Den Dool and Kratz RI, non-polar column, custom temperature program

Data compiled by: NIST Mass Spectrometry Data Center, William E. Wallace, director

Column type CapillaryCapillary
Active phase CP Sil 5 CBCP Sil 5 CB
Column length (m) 25.25.
Carrier gas HeHe
Substrate
Column diameter (mm) 0.250.25
Phase thickness (μm) 0.250.25
Program 60C (1min) => 20C/min => 170C => 4C/min => 290C60C (1min) => 20C/min => 170C => 4C/min => 290C
I 1984.1984.
ReferenceBlake, Taylor, et al., 2002Blake, Taylor, et al., 2002
Comment MSDC-RI MSDC-RI

References

Blake, Taylor, et al., 2002
Blake, P.S.; Taylor, J.M.; Finch-Savage, W.E., Identification of abscisic acid, indole-3-acetic acid, jasmonic acid, indole-3-acetonitrile, methyl jasmonate and gibberellins in developing, dormant and startified seeds of ash (Fraxinus excelsior), Plant Growth Regul., 2002, 37, 2, 119-125, https://doi.org/10.1023/A:1020504610172 . [all data]