7,11,17,25-tetramethylhentriacontane

Normal alkane RI, non-polar column, temperature ramp

Data compiled by: NIST Mass Spectrometry Data Center, William E. Wallace, director

Column type Capillary
Active phase DB-5
Column length (m) 30.
Carrier gas He
Substrate
Column diameter (mm) 0.32
Phase thickness (μm)
Tstart (C) 200.
Tend (C) 280.
Heat rate (K/min) 3.
Initial hold (min)
Final hold (min)
I 3240.
ReferenceJuárez, Blomquist, et al., 2001
Comment MSDC-RI

References

Juárez, Blomquist, et al., 2001
Juárez, P.; Blomquist, G.J.; Schofield, C.J., Hydrocarbons of Rhodnius prolixus, a Chagas disease vector, Comp. Biochem. Physiol. B: Comp. Biochem., 2001, 129, 4, 733-746, https://doi.org/10.1016/S1096-4959(01)00380-3 . [all data]