3α,7β,14α-trihydroxy-5β-cholan-24-oic acid, TMS

Kovats' RI, non-polar column, isothermal

Data compiled by: NIST Mass Spectrometry Data Center, William E. Wallace, director

Column type CapillaryCapillary
Active phase 5 % Phenyl methyl siloxane5 % Phenyl methyl siloxane
Column length (m) 25.25.
Carrier gas HeHe
Substrate
Column diameter (mm) 0.320.32
Phase thickness (μm) 0.250.25
Temperature (C) 280.280.
I 3184.3188.
ReferenceIida, Hikasaka, et al., 2001Iida, Hikasaka, et al., 2001
Comment MSDC-RI MSDC-RI

References

Iida, Hikasaka, et al., 2001
Iida, T.; Hikasaka, M.; Goto, J.; Nambara, T., Capillary gas chromatographic behaviour of tert.-hydroxylated steroids by trialkylsilylation, J. Chromatogr. A, 2001, 937, 1-2, 97-105, https://doi.org/10.1016/S0021-9673(01)01305-X . [all data]