(24R)-24-ethyl-5α-cholestan-3β-ol (stigmastanol), DMESI

Kovats' RI, non-polar column, isothermal

View large format table.

Column type Active phase Temperature (C) I Reference Comment
Capillary5 % Phenyl methyl siloxane280.3473.Iida, Hikasaka, et al., 200125. m/0.32 mm/0.25 μm, He

References

Iida, Hikasaka, et al., 2001
Iida, T.; Hikasaka, M.; Goto, J.; Nambara, T., Capillary gas chromatographic behaviour of tert.-hydroxylated steroids by trialkylsilylation, J. Chromatogr. A, 2001, 937, 1-2, 97-105, https://doi.org/10.1016/S0021-9673(01)01305-X . [all data]