2-Methylretene

Lee's RI, non-polar column, temperature ramp

View large format table.

Column type Active phase I Reference Comment
CapillaryHP-1MS376.91Bastow, Singh, et al., 200150. m/0.2 mm/0.25 μm, He, 3. K/min; Tstart: 40. C; Tend: 300. C
CapillaryZB-5374.35Bastow, Singh, et al., 200160. m/0.25 mm/0.25 μm, He, 3. K/min; Tstart: 40. C; Tend: 300. C

References

Bastow, Singh, et al., 2001
Bastow, T.P.; Singh, R.K.; van Aarssen, B.G.K.; Alexander, R.; Kagi, R.I., 2-Methylretene in sedimentary material: a new higher plant biomarker, Org. Geochem., 2001, 32, 10, 1211-1217, https://doi.org/10.1016/S0146-6380(01)00085-7 . [all data]