Fenproporex-M (N-desalkyl-HO-methoxy-), 2AC

Kovats' RI, non-polar column, temperature ramp

Data compiled by: NIST Mass Spectrometry Data Center, William E. Wallace, director

Column type Capillary
Active phase Cross-Linked Methylsilicone
Column length (m) 12.
Carrier gas He
Substrate
Column diameter (mm) 0.2
Phase thickness (μm) 0.33
Tstart (C) 100.
Tend (C) 310.
Heat rate (K/min) 30.
Initial hold (min) 3.
Final hold (min) 8.
I 2065.
ReferenceKraemer, Theis, et al., 2000
Comment MSDC-RI

References

Kraemer, Theis, et al., 2000
Kraemer, T.; Theis, G.A.; Weber, A.A.; Maurer, H.H., Studies on the metabolism and toxicological detection of the amphetamine-like anorectic fenproporex in human urine by gas chromatography-mass spectrometry and fluorescence polarization immunoassay, J. Chromatogr. B, 2000, 738, 1, 107-118, https://doi.org/10.1016/S0378-4347(99)00497-1 . [all data]