2,6,10,14-Tetramethyl-7-(3-methyl-pent-4-enylidene)-pentadeca-2,9(trans)-diene

Normal alkane RI, non-polar column, temperature ramp

View large format table.

Column type Active phase I Reference Comment
CapillaryHP-12124.Belt, Allard, et al., 2000He, 5. K/min, 300. C @ 10. min; Column length: 12. m; Column diameter: 0.2 mm; Tstart: 40. C
CapillaryHP-52136.Belt, Allard, et al., 2000He, 5. K/min, 300. C @ 10. min; Column length: 30. m; Column diameter: 0.25 mm; Tstart: 40. C

References

Belt, Allard, et al., 2000
Belt, S.T.; Allard, W.G.; Massé, G.; Robert, J.-M.; Rowland, S.J., Highly branched isoprenoids (HBIs): identification of the most common and abundant sedimentary isomers, Geochim. Cosmochim. Acta, 2000, 64, 22, 3839-3851, https://doi.org/10.1016/S0016-7037(00)00464-6 . [all data]