fusicoccadiene

Normal alkane RI, non-polar column, temperature ramp

View large format table.

Column type Active phase I Reference Comment
CapillaryCP Sil 5 CB1963.Rycroft, Cole, et al., 199925. m/0.32 mm/0.12 μm, He, 80. C @ 2. min, 5. K/min, 275. C @ 10. min

References

Rycroft, Cole, et al., 1999
Rycroft, D.S.; Cole, W.J.; Aslam, N.; Lamont, Y.M.; Gabriel, R., Killarniensolide, methyl orsellinates and 9,10-dihydrophenanthrenes from the liverwort Plagiochila killarniensis from Scotland and the Azores, Phytochemistry, 1999, 50, 7, 1167-1173, https://doi.org/10.1016/S0031-9422(98)00664-5 . [all data]