Benzoic acid 5-ethoxy-4-methoxy-2-methoxymethyl-tetrahydro-pyran-3-yl ester

Van Den Dool and Kratz RI, non-polar column, temperature ramp

View large format table.

Column type Active phase I Reference Comment
CapillaryHP-12096.31Lee, Kim, et al., 199930. m/0.25 mm/0.25 μm, 110. C @ 2. min, 2. K/min, 240. C @ 20. min
CapillaryHP-52135.14Lee, Kim, et al., 199930. m/0.53 mm/1. μm, 110. C @ 2. min, 2. K/min, 240. C @ 20. min

References

Lee, Kim, et al., 1999
Lee, C.K.; Kim, E.J.; Jun, J.H., Determination of relative reactivities of free hydroxyl groups in β-cyclodextrin, amylose, and cellulose by reduction-cleavage method, Bull. Korean Chem. Soc., 1999, 20, 10, 1153-1158. [all data]