Ergosta-5,7,9(11),22-tetraen-3β-ol, TMS

Van Den Dool and Kratz RI, non-polar column, temperature ramp

Data compiled by: NIST Mass Spectrometry Data Center, William E. Wallace, director

Column type CapillaryCapillary
Active phase OV-1SE-30
Column length (m) 25.30.
Carrier gas  He
Substrate
Column diameter (mm) 0.320.32
Phase thickness (μm)  0.25
Tstart (C) 220.220.
Tend (C) 75.
Heat rate (K/min) 1.2.
Initial hold (min)
Final hold (min)
I 3161.3161.
Referencele Fur, Maume, et al., 1999Le Fur, Maume, et al., 1999
Comment MSDC-RI MSDC-RI

References

le Fur, Maume, et al., 1999
le Fur, Y.; Maume, G.; Feuillat, M.; Maume, B.F., Characterization by gas chromatography/mass spectrometry of sterols in Saccharomyces cerevisiae during autolysis, J. Agric. Food Chem., 1999, 47, 7, 2860-2864, https://doi.org/10.1021/jf9806715 . [all data]

Le Fur, Maume, et al., 1999
Le Fur, Y.; Maume, G.; Feuillat, M.; Maume, B.F., Characterization by gas chromatography/mass spectrometry of sterols in Saccharomyces cerevisiae during autolysis, J. Agric. Food Chem., 1999, 47, 7, 2860-2864, https://doi.org/10.1021/jf9806715 . [all data]