14-Methyltriacontane

Normal alkane RI, non-polar column, custom temperature program

Data compiled by: NIST Mass Spectrometry Data Center, William E. Wallace, director

Column type CapillaryCapillaryCapillary
Active phase Methyl SiliconeDB-1Dexsil 300
Column length (m)  30.15.
Carrier gas  He
Substrate
Column diameter (mm)  0.32
Phase thickness (μm)  0.25
Program not specified60C (2min) => 10C/min => 220C => 3C/min => 310C (12 - 42 min)50 0C 5 0C/min -> 200 0C 2 0C/min -> 340 0C
I 3031.3035.3031.
ReferenceSullivan, 2002Carlson, Geden, et al., 1999Lockey, 1981
Comment MSDC-RI MSDC-RI MSDC-RI

References

Sullivan, 2002
Sullivan, B.T., Evidence for a sex pheromone in bark beetle parasitoid Roptrpcerus xylophagorum, J. Chem. Ecology, 2002, 28, 5, 1045-1063, https://doi.org/10.1023/A:1015270003717 . [all data]

Carlson, Geden, et al., 1999
Carlson, D.A.; Geden, C.J.; Bernier, U.R., Identification of pupal exiviae of Nasania vitripennis and Muscidifurax raptorellus parasitoids using cuticular hydrocarbons, Biol. Control, 1999, 15, 2, 97-106, https://doi.org/10.1006/bcon.1999.0708 . [all data]

Lockey, 1981
Lockey, K.H., Cuticular hydrocarbons of adult Cylindrinotus laevioctostriatus (Goeze) and Phylan gibbus (Fabricius) (Coleoptera: Tenebrionidae), Insect. Biochem., 1981, 11, 5, 549-561, https://doi.org/10.1016/0020-1790(81)90023-8 . [all data]