5β-Cholestane-3α,7α-diol, TMS

Normal alkane RI, non-polar column, temperature ramp

Data compiled by: NIST Mass Spectrometry Data Center, William E. Wallace, director

Column type Capillary
Active phase CP Sil 5 CB
Column length (m) 25.
Carrier gas He
Substrate
Column diameter (mm) 0.22
Phase thickness (μm)
Tstart (C) 100.
Tend (C) 278.
Heat rate (K/min) 35.
Initial hold (min) 2.
Final hold (min)
I 3212.
ReferenceBatta and Salen, 1999
Comment MSDC-RI

References

Batta and Salen, 1999
Batta, A.K.; Salen, G., Gas chromatography of bile acids, J. Chromatogr. B, 1999, 723, 1-2, 1-16, https://doi.org/10.1016/S0378-4347(98)00528-3 . [all data]